Year,Jurisdiction,Jur_Name,Parcel_ID,Account,Ownership_Sequence,Owner_Id,Owner_Prefix,Name,Careof,Street,Street_Overflow,City,State,Zip5,Zip4,Location_Code,Jur 1,Jur 2,Jur 3,Jur 4,Jur 5,Jur 6,Jur 7,Jur 8,Jur 9,Jur 10,Jur 11,Jur 12,Is_Exempt,Prop_Street_Number,Prop_Street,Prop_Street_Dir,Prop_City,Prop_State,Prop_Zip5,Prop_Zip4,Map1,Map2,Is_Protested,Has_Hs_Link,Primary_Category_Code,Secondary_Category_Code,Third_Category_Code,DBA,Interest,Ceiling_Year,Ceiling_Tax,Homestead_Code,Agent_Code,Agent_Name,Acres,Legal1,Legal2,Legal3,Legal4,Mortgage_Code,Lease_Number,Lease_Name,Operator_Name,RRC_Number,Interest_Type,Land_Hs,Land_Nhs,Land_Productivity_Market,Land_1d1,Land_1d,Land_Timber,Personal_Hs,Personal_Nhs,Market_Value,Net_Taxable_Value,State_Homestead,State_Mandated_Over65,State_Mandated_Disabled,Optional65,Local_Disabled,Road_Homestead,Disabled_Veteran,New_Personal_Hs,New_Personal_Nhs,Improvement_Hs,New_Improvement_Hs,Improvement_Nhs,New_Improvement_Nhs,Is_Owner_Confidential,Local_Discount,Has_Abatement,Has_Miscellaneous_Exemption,Abatement_Value,Mineral_Freeport_Value,Mineral_Unknown_Value
2021,CAD,CAD,14,10010-009-006-00,1,62241,R,CHAVARRIA AGUSTIN & BETTY M,,501 N HACKBERRY,,LAMPASAS,TX,76550,,94,CAD,LAM,LTR,R&B,SLA,,CLA,,,,,,False,501,HACKBERRY ST,N,LAMPASAS,TX,76550,,M15,,False,False,A1,,,,1.000000,0,0.00,H,,,0.2980,LOT:  LOTS 6-7,BLK:  9,ADDN: DIVISION A,,,,,,,,12120,0,0,0,0,0,0,0,156830,114840,0,0,0,0,0,0,0,0,0,141040,3670,0,0,False,0,False,False,0,0,0
2021,CAD,CAD,23,10010-010-010-00,1,16592,R,GILL JUSTO JR,,907 E AVE D,,LAMPASAS,TX,76550,2123,94,CAD,LAM,LTR,R&B,SLA,,CLA,,,,,,False,907,AVE D,E,LAMPASAS,TX,76550,,M15,,False,False,A1,,,,1.000000,0,0.00,H,,,0.1490,LOT:  10,BLK:  10,ADDN; DIVISION A,,,,,,,,6060,0,0,0,0,0,0,0,54570,36160,0,0,0,0,0,0,0,0,0,48510,0,0,0,False,0,False,False,0,0,0
2021,CAD,CAD,29,10010-011-003-00,1,51236,R,SMITH MICHAEL ETUX CHRISTINA,MICHAEL SMITH LIFE ESTATE,902 EAST AVENUE D,,LAMPASAS,TX,76550,,94,CAD,LAM,LTR,R&B,SLA,,CLA,,,,,,False,902,AVE D,E,LAMPASAS,TX,76550,,M15,,False,False,A1,,,,1.000000,0,0.00,H,,,0.2640,LOT:  2-3A,BLK:  11,ADDN: DIVISION A,"REPLAT OF LOTS 1,2,3 BLK 11",,,,,,,10770,0,0,0,0,0,0,0,58480,39510,0,0,0,0,0,0,0,0,0,47710,0,0,0,False,0,False,False,0,0,0
2021,CAD,CAD,62,10020-027-009-00,1,58165,R,RACE CAROL D,,2208 TETON AVENUE,,LAMPASAS,TX,76550,,94,CAD,LAM,LTR,R&B,SLA,,CLA,,,,,,False,705,MAIN ST,S,LAMPASAS,TX,76550,,M15,,False,False,B1,,,,1.000000,0,0.00,,,,0.2590,"LOT:  ALL 9,N 42  OF 10",BLK:  27,ADDN: A H BARNES,,,,,,,,24200,0,0,0,0,0,0,0,134430,134430,0,0,0,0,0,0,0,0,0,110230,0,0,0,False,0,False,False,0,0,0
2021,CAD,CAD,72,10020-028-009-00,1,63492,R,HARBORTH JASON AND JESSICA,,PO BOX 1670,,LAMPASAS,TX,76550,,94,CAD,LAM,LTR,R&B,SLA,,CLA,,,,,,False,607,MAIN ST,S,LAMPASAS,TX,76550,,M15,,False,False,A1,,,,1.000000,0,0.00,,,,0.2700,LOT:  LOTS 9-10,BLK:  28,ADDN: A H BARNES,,,,,,,,25300,0,0,0,0,0,0,0,155100,155100,0,0,0,0,0,0,0,0,0,129800,0,0,0,False,0,False,False,0,0,0
2021,CAD,CAD,78,10020-029-007-10,1,57492,R,WEEMS LYNDON ROSS,,208 SUNRISE HILLS,,LAMPASAS,TX,76550,,94,CAD,LAM,LTR,R&B,SLA,,CLA,,,,,,False,304,4TH ST,E,LAMPASAS,TX,76550,,M15,,False,False,F1,,,,1.000000,0,0.00,,,,0.1350,"LOT:  PT 7,8,9",BLK:  29,ADDN: A H BARNES,LINDA WEEMS CPA &,,,,,,,0,29180,0,0,0,0,0,0,239050,239050,0,0,0,0,0,0,0,0,0,0,0,209870,0,False,0,False,False,0,0,0
2021,CAD,CAD,86,10020-029-012-10,1,61734,R,PAST COUNSELING & WELLNESS PLLC,,PO BOX 1984,,LAMPASAS,TX,76550,,94,CAD,LAM,LTR,R&B,SLA,,CLA,,,,,,False,507,MAIN ST,S,LAMPASAS,TX,76550,,M15,,False,False,A1,,,,1.000000,0,0.00,,,,0.0750,LOT:  W PT 12,BLK:  29,ADDN: A H BARNES,,,,,,,,15180,0,0,0,0,0,0,0,134850,134850,0,0,0,0,0,0,0,0,0,119670,0,0,0,False,0,False,False,0,0,0
2021,CAD,CAD,89,10020-030-007-00,1,8700,R,CITY OF LAMPASAS,,312 E 3RD ST,,LAMPASAS,TX,76550,2820,94,CAD,LAM,LTR,R&B,SLA,,CLA,,,,,,True,302,3RD ST,E,LAMPASAS,TX,76550,,M15,,False,False,XV,,,,1.000000,0,0.00,,,,0.4050,LOT:  LOTS 7-8-9,BLK:  30,ADDN: A H BARNES,,,,,,,,0,75900,0,0,0,0,0,0,120440,0,0,0,0,0,0,0,0,0,0,0,0,44540,0,False,0,False,False,0,0,0
2021,CAD,CAD,96,10020-031-004-00,1,61100,R,FISH ANDREW,,PO BOX 1,,AUSTIN,TX,78767,,94,CAD,LAM,LTR,R&B,SLA,,CLA,,,,,,False,302,WESTERN AVE,S,LAMPASAS,TX,76550,,M15,,False,False,F1,,,,1.000000,0,0.00,,,,0.4060,LOT:  LOTS 4-5-6,BLK:  31,ADDN: A H BARNES,LAMPASAS HARDWARE,,,,,,,0,62930,0,0,0,0,0,0,245330,245330,0,0,0,0,0,0,0,0,0,0,0,182400,0,False,0,False,False,0,0,0
2021,CAD,CAD,98,10020-031-007-10,1,47490,R,WADE JOHNNY H ETUX AMANDA S,,PO BOX 1560,,LAMPASAS,TX,76550,,94,CAD,LAM,LTR,R&B,SLA,,CLA,,,,,,False,304,2ND ST,E,LAMPASAS,TX,76550,,M15,,False,False,F1,,,,1.000000,0,0.00,,,,0.0670,"LOT:  MID 21  LTS 7,8,9",BLK:  31,ADDN: A H BARNES,,,,,,,,0,7760,0,0,0,0,0,0,55950,55950,0,0,0,0,0,0,0,0,0,0,0,48190,0,False,0,False,False,0,0,0
2021,CAD,CAD,112,10020-033-001-00,1,579,R,ALEXANDER LLOYD JR ETUX JANICE E,,106 S WESTERN AVE,,LAMPASAS,TX,76550,,94,CAD,LAM,LTR,R&B,SLA,,CLA,,,,,,False,106,WESTERN AVE,S,LAMPASAS,TX,76550,,M15,,False,False,A1,,,,1.000000,0,0.00,H,,,0.3830,"LOT:1, 2 & 3",BLK:  33,ADDN: A H BARNES,,,,,,,,22770,14190,0,0,0,0,0,0,206970,181080,0,0,0,0,0,0,0,0,0,139380,0,30630,0,False,0,False,False,0,0,0
2021,CAD,CAD,119,10020-033-012-00,1,59451,R,DEWITT C OWEN JR ETUX CATHY K,,334 PASEO ROBLES,,LAMPASAS,TX,76550,,94,CAD,LAM,LTR,R&B,SLA,,CLA,,,,,,False,303,1ST ST,E,LAMPASAS,TX,76550,,M15,,False,False,A1,,,,1.000000,0,0.00,,,,0.0820,LOT:  S 1/2 11 & PT OF 12,BLK:  33,ADDN: A H BARNES,,,,,,,,18980,0,0,0,0,0,0,0,44110,44110,0,0,0,0,0,0,0,0,0,25130,0,0,0,False,0,False,False,0,0,0
2021,CAD,CAD,122,10020-034-003-00,1,13500,R,ELDER JAY T & CATHIE D,,3601 CR 1020,,LAMPASAS,TX,76550,,94,CAD,LAM,LTR,R&B,SLA,,CLA,,,,,,False,104,MAIN ST,S,LAMPASAS,TX,76550,,M15,,False,False,A1,,,,1.000000,0,0.00,,,,0.2700,LOT:  LOTS 3-4,BLK:  34,ADDN: A H BARNES,,,,,,,,25300,0,0,0,0,0,0,0,90340,90340,0,0,0,0,0,0,0,0,0,65040,0,0,0,False,0,False,False,0,0,0
2021,CAD,CAD,136,10020-035-011-10,1,52087,R,COCKRELL ROY E,,PO BOX 383,,LAMPASAS,TX,76550,,94,CAD,LAM,LTR,R&B,SLA,,CLA,,,,,,False,203,2ND ST,E,LAMPASAS,TX,76550,,M15,,False,False,B1,,,,1.000000,0,0.00,,,,0.1350,LOT:  E 1/2  OF LOTS 11-12,BLK:  35,ADDN: A H BARNES,,,,,,,,0,10560,0,0,0,0,0,0,78330,78330,0,0,0,0,0,0,0,0,0,0,0,67770,0,False,0,False,False,0,0,0
2021,CAD,CAD,159,10020-038-007-00,1,13684,R,EPISCOPAL CHURCH,,503 S CHESTNUT ST,,LAMPASAS,TX,76550,3225,94,CAD,LAM,LTR,R&B,SLA,,CLA,,,,,,True,503,CHESTNUT ST,S,LAMPASAS,TX,76550,,M15,,False,False,XV,,,,1.000000,0,0.00,,,,0.8110,LOT:  LOTS 7-8-9-10-11-12,BLK:  38,ADDN: A H BARNES,,,,,,,,0,96140,0,0,0,0,0,0,96140,0,0,0,0,0,0,0,0,0,0,0,0,0,0,False,0,False,False,0,0,0
2021,CAD,CAD,187,10020-042-003-00,1,49259,R,WILLIAMS BETTY,C/O CHARALENA GADDY,1904 SAUNDERS ST,,GATESVILLE,TX,76528,1754,94,CAD,LAM,LTR,R&B,SLA,,CLA,,,,,,False,908,MAIN ST,S,LAMPASAS,TX,76550,,M15,,False,False,C1,,,,1.000000,0,0.00,,,,0.1350,LOT:  3,BLK:  42,ADDN: A H BARNES,,,,,,,,12650,0,0,0,0,0,0,0,12650,12650,0,0,0,0,0,0,0,0,0,0,0,0,0,False,0,False,False,0,0,0
2021,CAD,CAD,189,10020-042-005-00,1,59053,R,SUTTON RONNIE L & VICKI A WHITNEY,,906 SOUTH MAIN ST,,LAMPASAS,TX,76550,,94,CAD,LAM,LTR,R&B,SLA,,CLA,,,,,,False,904,MAIN ST,S,LAMPASAS,TX,76550,,M15,,False,False,C1,,,,1.000000,0,0.00,,,,0.1350,LOT:  5,BLK:  42,ADDN: A H BARNES,,,,,,,,12650,0,0,0,0,0,0,0,12650,12650,0,0,0,0,0,0,0,0,0,0,0,0,0,False,0,False,False,0,0,0
2021,CAD,CAD,222,10020-047-003-00,1,18585,R,HALE TRUMAN,,905 ANVIL CREEK DR,,ARLINGTON,TX,76001,6111,66,CAD,LAM,CLA,R&B,SLA,,,,,,,,False,508,CHESTNUT ST,S,LAMPASAS,TX,76550,,M15,,False,False,A1,,,,1.000000,0,0.00,,,,0.2700,LOT:  LOTS 3-4,BLK:  47,ADDN: A H BARNES,,,,,,,,40480,0,0,0,0,0,0,0,68740,68740,0,0,0,0,0,0,0,0,0,28260,0,0,0,False,0,False,False,0,0,0
2021,CAD,CAD,223,10020-047-005-00,1,55426,R,PROTESTANT EPISCOPAL CHURCH,COUNCIL OF THE DIOCESE OF TX,1225 TEXAS AVE,,HOUSTON,TX,77002,,94,CAD,LAM,LTR,R&B,SLA,,CLA,,,,,,True,504,CHESTNUT ST,S,LAMPASAS,TX,76550,,M15,,False,False,XV,,,,1.000000,0,0.00,,,,0.1360,LOT:  E 1/2 5 & 6,BLK:  47,ADDN: A H BARNES,,,,,,,,25260,0,0,0,0,0,0,0,25260,0,0,0,0,0,0,0,0,0,0,0,0,0,0,False,0,False,False,0,0,0
2021,CAD,CAD,240,10020-049-003-00,1,56204,R,FAULKNER SUE Z & MARY J MCMILLIN,,PO BOX 166,,LAMPASAS,TX,76550,,94,CAD,LAM,LTR,R&B,SLA,,CLA,,,,,,False,306,CHESTNUT ST,S,LAMPASAS,TX,76550,,M15,,False,False,A1,,,,1.000000,0,0.00,,,,0.1350,LOT:  3,BLK:  49,ADDN: A H BARNES,,,,,,,,20240,0,0,0,0,0,0,0,78800,78800,0,0,0,0,0,0,0,0,0,58560,0,0,0,False,0,False,False,0,0,0
2021,CAD,CAD,241,10020-049-004-00,1,63452,R,GARRETT JAMIE,,PO BOX 496,,LAMPASAS,TX,76550,,94,CAD,LAM,LTR,R&B,SLA,,CLA,,,,,,False,304,CHESTNUT ST,S,LAMPASAS,TX,76550,,M15,,False,False,A1,,,,1.000000,0,0.00,,,,0.1350,LOT:  4,BLK:  49,ADDN: A H BARNES,,,,,,,,20240,0,0,0,0,0,0,0,84060,84060,0,0,0,0,0,0,0,0,0,63820,0,0,0,False,0,False,False,0,0,0
2021,CAD,CAD,245,10020-049-009-00,1,3487,R,BERRY MAX D,,105 SADDLE TRAIL,,GEORGETOWN,TX,78633,4891,94,CAD,LAM,LTR,R&B,SLA,,CLA,,,,,,False,305,KEY AVE,S,LAMPASAS,TX,76550,,M15,,False,False,F1,,,,1.000000,0,0.00,,491,OCONNOR & ASSOCIATES,0.4050,LOT:  9 & PART LOT 10,BLK:  49,ADDN: A H BARNES,,,,,,,,0,148280,0,0,0,0,0,0,337480,337480,0,0,0,0,0,0,0,0,0,0,0,189200,0,False,0,False,False,0,0,0
2021,CAD,CAD,247,10020-050-001-00,1,17468,R,GRADEL ROBERT J & ROBERTA J,,107 E 2ND ST,,LAMPASAS,TX,76550,2802,94,CAD,LAM,LTR,R&B,SLA,,CLA,,,,,,False,107,2ND ST,E,LAMPASAS,TX,76550,,M15,,False,False,F1,,,,1.000000,0,0.00,,,,0.4050,LOT:  LOTS 1-2-3,BLK:  50,ADDN: A H BARNES,,,,,,,,0,68170,0,0,0,0,0,0,151000,151000,0,0,0,0,0,0,0,0,0,500,0,82330,0,False,0,False,False,0,0,0
2021,CAD,CAD,249,10020-050-007-00,1,53098,R,27 VILLAGE PATEL CORPORATION,,201-203 S KEY AVE,,LAMPASAS,TX,76550,,94,CAD,LAM,LTR,R&B,SLA,,CLA,,,,,,False,201,KEY AVE,S,LAMPASAS,TX,76550,,M15,,False,False,F1,,,,1.000000,0,0.00,,,,0.4060,LOT:  LOTS 7-8-9,BLK:  50,ADDN: A H BARNES,THE BOTTLE SHOP,,,,,,,0,153390,0,0,0,0,0,0,314900,314900,0,0,0,0,0,0,0,0,0,0,0,161510,0,False,0,False,False,0,0,0
2021,CAD,CAD,298,10030-001-001-00,1,3710,R,BILLINGS ILLI B,,1 CAMERON DR,,LAMPASAS,TX,76550,9998,94,CAD,LAM,LTR,R&B,SLA,,CLA,,,,,,False,1,CAMERON DR,,LAMPASAS,TX,76550,,L14,,False,False,A1,,,,1.000000,0,0.00,H,,,0.1790,LOT: 1,BLK: A,SUBV: CAMERON,,,,,,,,12870,0,0,0,0,0,0,0,78620,64090,0,0,0,0,0,0,0,0,0,65750,0,0,0,False,0,False,False,0,0,0
2021,CAD,CAD,302,10030-001-005-00,1,64317,R,BROOKS CHAD ALLEN,,9 CAMERON DR,,LAMPASAS,TX,76550,,94,CAD,LAM,LTR,R&B,SLA,,CLA,,,,,,False,9,CAMERON DR,,LAMPASAS,TX,76550,,L14,,False,False,A1,,,,1.000000,0,0.00,,,,0.1790,LOT: 5,BLK: A,ADDN: CAMERON,,,,,,,,12870,0,0,0,0,0,0,0,97390,97390,0,0,0,0,0,0,0,0,0,84520,0,0,0,False,0,False,False,0,0,0
2021,CAD,CAD,315,10030-002-006-00,1,29270,R,MATTHEWS DAVID L ETUX LAURAL L,,1703 E 4TH ST,,LAMPASAS,TX,76550,9998,105,CAD,LAM,LTR,R&B,SLA,CLA,,,,,,,False,12,CAMERON DR,,LAMPASAS,TX,76550,,L14,,False,False,A1,,,,1.000000,0,0.00,,,,0.1620,LOT: 6,BLK: B,ADDN: CAMERON,,,,,,,,11630,0,0,0,0,0,0,0,97140,97140,0,0,0,0,0,0,0,0,0,85510,0,0,0,False,0,False,False,0,0,0
2021,CAD,CAD,328,10030-003-012-00,1,63828,R,BREWER FRIDA ELENORA,,24 STEELE ST,,LAMPASAS,TX,76550,,94,CAD,LAM,LTR,R&B,SLA,,CLA,,,,,,False,24,STEELE ST,,LAMPASAS,TX,76550,,L14,,False,False,A1,,,,1.000000,0,0.00,,,,0.2090,LOT: 12,BLK: C,ADDN: CAMERON SUBD C,,,,,,,,15020,0,0,0,0,0,0,0,128290,128290,0,0,0,0,0,0,0,0,0,113270,0,0,0,False,0,False,False,0,0,0
2021,CAD,CAD,338,10040-000-008-00,1,62336,R,ROSS WILLIAM F JR & BETTY JEAN,,15 CASTLEBERRY ST,,LAMPASAS,TX,76550,,94,CAD,LAM,LTR,R&B,SLA,,CLA,,,,,,False,15,CASTLEBERRY ST,,LAMPASAS,TX,76550,,L14,,False,False,A1,,,,1.000000,0,0.00,,,,0.2250,LOT:  8,BLK:,ADDN:  CASTLE HEIGHTS,,,,,,,,18330,0,0,0,0,0,0,0,125640,125640,0,0,0,0,0,0,0,0,0,107310,0,0,0,False,0,False,False,0,0,0
2021,CAD,CAD,380,10050-002-012-00,1,61963,R,MATURA JAMES & TAMMY,,1302 W AVE A,,LAMPASAS,TX,76550,,94,CAD,LAM,LTR,R&B,SLA,,CLA,,,,,,False,1302,AVE A,W,LAMPASAS,TX,76550,,L14,,False,False,A1,,,,1.000000,0,0.00,H,,,0.3130,LOT: 12,BLK: 2,ADDN: COLONIAL HEIGHTS,,,,,,,,25460,0,0,0,0,0,0,0,198600,167190,0,0,0,0,0,0,0,0,0,173140,0,0,0,False,0,False,False,0,0,0
2021,CAD,CAD,392,10050-003-012-00,1,5823,R,BROWN GARY W ETUX PEGGY D,,1302 W AVE B,,LAMPASAS,TX,76550,9998,94,CAD,LAM,LTR,R&B,SLA,,CLA,,,,,,False,1302,AVE B,W,LAMPASAS,TX,76550,,L14,,False,False,A1,,,,1.000000,0,0.00,H,,,0.2910,LOT: 12,BLK: 3,ADDN: COLONIAL HEIGHTS,,,,,,,,23740,0,0,0,0,0,0,0,253310,215040,0,0,0,0,0,0,0,0,0,229570,0,0,0,False,0,False,False,0,0,0
2021,CAD,CAD,409,10050-005-008-00,1,59342,R,JASPER LINDA J,THE LADYBIRD LIFE ESTATE,1410 WEST AVE A,,LAMPASAS,TX,76550,,94,CAD,LAM,LTR,R&B,SLA,,CLA,,,,,,False,1410,AVE A,W,LAMPASAS,TX,76550,,L14,,False,False,A1,,,,1.000000,0,0.00,H,,,0.3130,LOT: 8,BLK: 5,ADDN: COLONIAL HEIGHTS,,,,,,,,22470,0,0,0,0,0,0,0,110640,98230,0,0,0,0,0,0,0,0,0,88170,0,0,0,False,0,False,False,0,0,0
2021,CAD,CAD,487,10060-007-005-20,1,63325,R,VARNEY SHANE F & ANDERMAN SABRINA,SMITH STACIA H,P.O. BOX 1407,,LAMPASAS,TX,76550,,94,CAD,LAM,LTR,R&B,SLA,,CLA,,,,,,False,1102,4TH ST,E,LAMPASAS,TX,76550,,M15,,False,False,A1,,,,1.000000,0,0.00,,,,0.4780,LOT:  PT LOT 5 & PT LOT 8,BLK:  7,ADDN: EAST LAMPASAS,,,,,,,,27460,0,0,0,0,0,0,0,148600,148600,0,0,0,0,0,0,0,0,0,121140,0,0,0,False,0,False,False,0,0,0
2021,CAD,CAD,493,10060-008-002-20,1,25940,R,KUSY DOUGLAS R ETUX CAROL J,,614 BROWN ST,,LAMPASAS,TX,76550,,94,CAD,LAM,LTR,R&B,SLA,,CLA,,,,,,False,614,BROWN ST,,LAMPASAS,TX,76550,,M15,,False,False,A1,,,,1.000000,0,0.00,H,,,0.3720,LOT:  PART LOTS 2-3,BLK:  8,ADDN: EAST LAMPASAS,,,,,,,,20700,0,0,0,0,0,0,0,98060,67400,0,0,0,0,0,0,0,0,0,71070,0,6290,0,False,0,False,False,0,0,0
2021,CAD,CAD,501,10060-009-002-10,1,55308,R,HARDMAN DON L ETUX LINDA F,,1204 BRIDGE ST,,LAMPASAS,TX,76550,,94,CAD,LAM,LTR,R&B,SLA,,CLA,,,,,,False,1204,BRIDGE ST,,LAMPASAS,TX,76550,,M15,,False,False,A1,,,,1.000000,0,0.00,H,,,0.2480,LOT:  PT L2 & PT L3,BLK:  9,ADDN: EAST LAMPASAS,,,,,,,,13530,0,0,0,0,0,0,0,93460,75220,0,0,0,0,0,0,0,0,0,79930,0,0,0,False,0,False,False,0,0,0
2021,CAD,CAD,511,10060-009-014-00,1,4997,R,BRADFORD VICTORIA & TERRY W GABRIEL,,114 E DENTON DR,,EULESS,TX,76039,3439,94,CAD,LAM,LTR,R&B,SLA,,CLA,,,,,,False,1205,CLOUD ST,,LAMPASAS,TX,76550,,M15,,False,False,A1,,,,1.000000,0,0.00,H,,,0.2120,LOT:  14 & E 1/2 15,BLK:  9,ADDN: EAST LAMPASAS,,,,,,,,11810,0,0,0,0,0,0,0,108150,100130,0,0,0,0,0,0,0,0,0,96340,0,0,0,False,0,False,False,0,0,0
2021,CAD,CAD,526,10060-012-001-00,1,166,R,ABRAHAM RICKEY J,,1088 NARUNA RD,,LAMPASAS,TX,76550,,94,CAD,LAM,LTR,R&B,SLA,,CLA,,,,,,False,905,4TH ST,E,LAMPASAS,TX,76550,,M15,,False,False,C1,,,,1.000000,0,0.00,,,,0.2480,LOT:  1,BLK:  12,ADDN: EAST LAMPASAS,,,,,,,,14280,0,0,0,0,0,0,0,14280,14280,0,0,0,0,0,0,0,0,0,0,0,0,0,False,0,False,False,0,0,0
2021,CAD,CAD,529,10060-013-001-00,1,18816,R,HAMILTON DAVID B ETUX VIRGINIA B,,PO BOX 36,,LOMETA,TX,76853,0036,94,CAD,LAM,LTR,R&B,SLA,,CLA,,,,,,False,1205,4TH ST,E,LAMPASAS,TX,76550,,M15,,False,False,F1,,,,1.000000,0,0.00,,,,1.6810,LOT:  LOTS 1-2-3 PART 4-5,.07 AC A-42,BLK:  13 SOUTH,ADDN: EAST LAMPASAS,,,,,,,0,75120,0,0,0,0,0,0,120930,120930,0,0,0,0,0,0,0,0,0,0,0,45810,0,False,0,False,False,0,0,0
2021,CAD,CAD,540,10070-001-001-00,1,31343,R,MILLIGAN LARRY L ETAL,C/O MARY JEWELL MILLIGAN,712 DENT ST,,LAMPASAS,TX,76550,3344,94,CAD,LAM,LTR,R&B,SLA,,CLA,,,,,,False,,DENT ST,,LAMPASAS,TX,76550,,M15,,False,False,D1,,,,1.000000,0,0.00,,,,0.1980,LOT:  1,BLK:  A,ADDN: CAMERON ADDITION TO,EAST LAMPASAS,,,,,,,0,0,11010,20,0,0,0,0,11010,20,0,0,0,0,0,0,0,0,0,0,0,0,0,False,0,False,False,0,0,0
2021,CAD,CAD,576,10090-001-010-00,1,32610,R,MYERS CRAYMON AUGUSTA SR,,202 FAIRVIEW ST,,LAMPASAS,TX,76550,1519,94,CAD,LAM,LTR,R&B,SLA,,CLA,,,,,,False,202,FAIRVIEW LN,,LAMPASAS,TX,76550,,L14,,False,False,A1,,,,1.000000,0,0.00,H,,,0.5790,LOT:  10 & PT ABND AVE A & 9,BLK:  1,ADDN: FAIRVIEW,,,,,,,,40840,0,0,0,0,0,0,0,180930,154740,0,0,0,0,0,0,0,0,0,140090,0,0,0,False,0,False,False,0,0,0
2021,CAD,CAD,602,10100-005-001-10,1,42677,R,STATE OF TEXAS,C/O TEXAS DEPT OF TRANSPORTATION,2495 HWY 183 N,,BROWNWOOD,TX,76802,,94,CAD,LAM,LTR,R&B,SLA,,CLA,,,,,,True,,FM 580,E,LAMPASAS,TX,76550,,M15,,False,False,XV,,,,1.000000,0,0.00,,,,0.4040,LOT:  PT 10-12,BLK:  5,ADDN: G C & S F,,,,,,,,16460,0,0,0,0,0,0,0,16460,0,0,0,0,0,0,0,0,0,0,0,0,0,0,False,0,False,False,0,0,0
2021,CAD,CAD,607,10100-008-003-00,1,39932,R,SCHULZ JURGEN,,1691 COUNTY ROAD 2806,,LAMPASAS,TX,76550,9704,94,CAD,LAM,LTR,R&B,SLA,,CLA,,,,,,False,1105,AVE F,E,LAMPASAS,TX,76550,,M15,,False,False,A1,,,,1.000000,0,0.00,,,,0.1320,LOT:  3,BLK:  8,ADDN: G C & S F,,,,,,,,5380,0,0,0,0,0,0,0,137650,137650,0,0,0,0,0,0,0,0,0,132270,0,0,0,False,0,False,False,0,0,0
2021,CAD,CAD,611,10100-009-003-00,1,39932,R,SCHULZ JURGEN,,1691 COUNTY ROAD 2806,,LAMPASAS,TX,76550,9704,94,CAD,LAM,LTR,R&B,SLA,,CLA,,,,,,False,1104,AVE G,E,LAMPASAS,TX,76550,,M15,,False,False,A1,,,,1.000000,0,0.00,,,,0.2640,LOT:   3,BLK:  9,ADDN: G C & S F,,,,,,,,10750,0,0,0,0,0,0,0,147810,147810,0,0,0,0,0,0,0,0,0,137060,0,0,0,False,0,False,False,0,0,0
2021,CAD,CAD,622,10100-010-015-00,1,63675,R,"SALINAS ROY AND UNION CHAPEL, SERIES ONLY","A SERIES OF SALMAC CONSTRUCTION & EXCAVATING, LLC",6408 LYNCH LANE,,AUSTIN,TX,78741,,94,CAD,LAM,LTR,R&B,SLA,,CLA,,,,,,False,1110,AVE H,E,LAMPASAS,TX,76550,,M15,,False,False,A1,,,,1.000000,0,0.00,,,,0.1320,"LOT:  E 20  LOT 15,ALL 16",BLK:  10,ADDN: G C & S F,,,,,,,,5380,0,0,0,0,0,0,0,37690,37690,0,0,0,0,0,0,0,0,0,32310,0,0,0,False,0,False,False,0,0,0
2021,CAD,CAD,632,10100-016-003-00,1,60136,R,CALDWELL LAURA J,,1206 E AVE. G,,LAMPASAS,TX,76550,,94,CAD,LAM,LTR,R&B,SLA,,CLA,,,,,,False,1206,AVE G,E,LAMPASAS,TX,76550,,M15,,False,False,A1,,,,1.000000,0,0.00,H,,,0.1320,LOT: 3,BLK:  16,ADDN: G C & S F,,,,,,,,5380,0,0,0,0,0,0,0,113460,104460,0,0,0,0,0,0,0,0,0,108080,0,0,0,False,0,False,False,0,0,0
2021,CAD,CAD,640,10100-017-007-30,1,53481,R,PARRILLA FRED ETUX BETTY J ROACH,,506 N SUMMER,,LAMPASAS,TX,76550,,94,CAD,LAM,LTR,R&B,SLA,,CLA,,,,,,False,805,HOOVER ST,,LAMPASAS,TX,76550,,M15,,False,False,C1,,,,1.000000,0,0.00,,,,0.0830,LOT:  S1/2 LOTS 10 & 11,BLK:  17,ADDN: G C & S F,,,,,,,,3370,0,0,0,0,0,0,0,3370,3370,0,0,0,0,0,0,0,0,0,0,0,0,0,False,0,False,False,0,0,0
2021,CAD,CAD,644,10100-018-000-10,1,55482,R,BRENEMAN BETTY J,,902 N MCLEAN,,LAMPASAS,TX,76550,,66,CAD,LAM,CLA,R&B,SLA,,,,,,,,False,902,MCLEAN ST,N,LAMPASAS,TX,76550,,M15,,False,False,A1,,,,1.000000,0,0.00,H,,,0.7920,LOT:  LOTS 1-16,BLK:  18,ADDN: G C & S F,,,,,,,,32260,0,0,0,0,0,0,0,153300,121390,0,0,0,0,0,0,0,0,0,121040,0,0,0,False,0,False,False,0,0,0
2021,CAD,CAD,650,10100-020-008-00,1,5744,R,BROWN BURKE,,PO BOX 925,,LAMPASAS,TX,76550,0925,94,CAD,LAM,LTR,R&B,SLA,,CLA,,,,,,False,1204,AVE K,E,LAMPASAS,TX,76550,,M15,,False,False,C1,,,,1.000000,0,0.00,,,,0.2640,LOT:  LOTS 8-9,BLK:  20,ADDN: G C & S F,,,,,,,,17080,0,0,0,0,0,0,0,17080,17080,0,0,0,0,0,0,0,0,0,0,0,0,0,False,0,False,False,0,0,0
2021,CAD,CAD,713,10100-043-003-00,1,15767,R,DOWE PHYLLIS,,1606 E. AVE. G,,LAMPASAS,TX,76550,,94,CAD,LAM,LTR,R&B,SLA,,CLA,,,,,,False,1606,AVE G,E,LAMPASAS,TX,76550,,M15,,False,False,A1,,,,1.000000,0,0.00,H,,,0.1980,LOT:  3 & W 1/2 LT 4,BLK:  43,ADDN: G C & S F,,,,,,,,8060,0,0,0,0,0,0,0,108500,89770,0,0,0,0,0,0,0,0,0,100440,0,0,0,False,0,False,False,0,0,0
2021,CAD,CAD,723,10100-044-012-00,1,40105,R,SECOND BAPTIST CHURCH,,PO BOX 664,,LAMPASAS,TX,76550,0664,94,CAD,LAM,LTR,R&B,SLA,,CLA,,,,,,True,808,CASBEER ST,,LAMPASAS,TX,76550,,M15,,False,False,XV,,,,1.000000,0,0.00,,,,0.0000,LOT:  LOTS 12-13-14,BLK:  44,ADDN: G C & S F,,,,,,,,0,0,0,0,0,0,0,0,222320,0,0,0,0,0,0,0,0,0,0,0,0,222320,0,False,0,False,False,0,0,0
2021,CAD,CAD,744,10100-048-000-10,1,3430,R,BERRY THOMAS VAN,,385 CR 3420,,LAMPASAS,TX,76550,,66,CAD,LAM,CLA,R&B,SLA,,,,,,,,False,,CR 3420,,LAMPASAS,TX,76550,,M15,,False,False,D1,,,,1.000000,0,0.00,,,,0.8500,"LOT:  4,5,6,7",BLK:  48 TR1,ADDN: G C & S F,,,,,,,,0,0,13240,70,0,0,0,0,13240,70,0,0,0,0,0,0,0,0,0,0,0,0,0,False,0,False,False,0,0,0
2021,CAD,CAD,772,10110-012-000-10,1,26287,R,LAMPASAS ISD,,207 W 8TH ST,,LAMPASAS,TX,76550,,94,CAD,LAM,LTR,R&B,SLA,,CLA,,,,,,True,,,,LAMPASAS,TX,76550,,M15,,False,False,XV,,,,1.000000,0,0.00,,,,0.0000,LOT:  PART BLK 12,BLK:,ADDN: HANNA SPRINGS,,,,,,,,16500,0,0,0,0,0,0,0,16500,0,0,0,0,0,0,0,0,0,0,0,0,0,0,False,0,False,False,0,0,0
2021,CAD,CAD,777,10110-021-000-20,1,60179,R,JIANG XIAOYU,,217 SUNDANCE DR,,HOLLISTER,CA,95023,,94,CAD,LAM,LTR,R&B,SLA,,CLA,,,,,,False,301,KEY AVE,N,LAMPASAS,TX,76550,,M15,,False,False,F1,,,,1.000000,0,0.00,,,,0.4120,LOT:  SW 1/4 OF BLK 21,BLK:  21,ADDN: HANNA SPRINGS,,,,,,,,0,150790,0,0,0,0,0,0,221890,221890,0,0,0,0,0,0,0,0,0,0,0,71100,0,False,0,False,False,0,0,0
2021,CAD,CAD,779,10110-022-000-10,1,54793,R,MASON BETTY JO,,1103 GREY OAK,,SAN ANTONIO,TX,78213,,94,CAD,LAM,LTR,R&B,SLA,,CLA,,,,,,False,404,CHESTNUT ST,N,LAMPASAS,TX,76550,,M15,,False,False,A1,,,,1.000000,0,0.00,,,,0.6710,LOT:  PT E 1/2 BLK 22 S&E .162,BLK:  22,ADDN: HANNA SPRINGS,,,,,,,,69300,0,0,0,0,0,0,0,139070,139070,0,0,0,0,0,0,0,0,0,69770,0,0,0,False,0,False,False,0,0,0
2021,CAD,CAD,791,10120-002-004-00,1,62743,R,*** CONFIDENTIAL OWNER ***,,,,,,,,94,CAD,LAM,LTR,R&B,SLA,,CLA,,,,,,False,,,,,,,,M15,,False,False,A1,,,,1.000000,0,0.00,H,,,0.3900,* CONFIDENTIAL OWNER *,,,,,,,,,,31740,0,0,0,0,0,0,0,146320,137050,0,0,0,0,0,0,0,0,0,114580,0,0,0,True,0,False,False,0,0,0
2021,CAD,CAD,793,10120-002-006-00,1,58413,R,PETERS PATRICIA & MICHAEL TURNER,,503 SOUTH ARNOLD ST,,LAMPASAS,TX,76550,,94,CAD,LAM,LTR,R&B,SLA,,CLA,,,,,,False,503,ARNOLD ST,S,LAMPASAS,TX,76550,,M15,,False,False,A1,,,,1.000000,0,0.00,H,,,0.2060,LOT:  6,BLK:  2,SUBD: F J HARRIS,,,,,,,,13460,0,0,0,0,0,0,0,163850,163850,0,0,0,0,0,0,0,0,0,150390,0,0,0,False,0,False,False,0,0,0
2021,CAD,CAD,794,10120-002-007-00,1,7809,R,CASBEER T J III & MARTHA,,PO BOX 1877,,LAMPASAS,TX,76550,1877,66,CAD,LAM,CLA,R&B,SLA,,,,,,,,False,507,ARNOLD ST,S,LAMPASAS,TX,76550,,M15,,False,False,A1,,,,1.000000,0,0.00,,,,0.4120,LOT:  LOTS 7 & 8,BLK:  2,SUBD: F J HARRIS,,,,,,,,33550,0,0,0,0,0,0,0,137800,137800,0,0,0,0,0,0,0,0,0,104250,0,0,0,False,0,False,False,0,0,0
2021,CAD,CAD,839,10140-001-013-00,1,4937,R,BOZARTH MACKEY J,,507 S KEY,,LAMPASAS,TX,76550,,94,CAD,LAM,LTR,R&B,SLA,,CLA,,,,,,False,208,SKYVIEW DR,,LAMPASAS,TX,76550,,L14,,False,False,A1,,,,1.000000,0,0.00,,,,0.2290,LOT:  13,BLK:  A,ADDN: HIGHLAND PARK,,,,,,,,16460,0,0,0,0,0,0,0,125680,125680,0,0,0,0,0,0,0,0,0,109220,0,0,0,False,0,False,False,0,0,0
2021,CAD,CAD,842,10140-001-016-00,1,60656,R,SUGG DELBERT,,PO BOX 165,,LAMPASAS,TX,76550,,94,CAD,LAM,LTR,R&B,SLA,,CLA,,,,,,False,1212,1ST ST,W,LAMPASAS,TX,76550,,L14,,False,False,A1,,,,1.000000,0,0.00,H,,,0.1690,LOT:  16,BLK:  A,ADDN: HIGHLAND PARK,,,,,,,,13760,0,0,0,0,0,0,0,172690,143840,0,0,0,0,0,0,0,0,0,158930,0,0,0,False,0,False,False,0,0,0
2021,CAD,CAD,848,10140-002-006-00,1,54904,R,GRIFFIN JAN E,,211 SKYVIEW DR,,LAMPASAS,TX,76550,,105,CAD,LAM,LTR,R&B,SLA,CLA,,,,,,,False,211,SKYVIEW DR,,LAMPASAS,TX,76550,,L14,,False,False,A1,,,,1.000000,0,0.00,H,,,0.2270,LOT:  6,BLK:  B,ADDN: HIGHLAND PARK,,,,,,,,16340,0,0,0,0,0,0,0,122090,97570,0,0,0,0,0,0,0,0,0,105750,0,0,0,False,0,False,False,0,0,0
2021,CAD,CAD,854,10140-002-012-00,1,57411,R,ANKENBAUER TOMMY ETUX CATHERINE,,210 LANDON DRIVE,,LAMPASAS,TX,76550,,94,CAD,LAM,LTR,R&B,SLA,,CLA,,,,,,False,210,LANDON DR,,LAMPASAS,TX,76550,,L14,,True,False,A1,,,,1.000000,0,0.00,,,,0.2350,LOT:  12,BLK:  B,ADDN: HIGHLAND PARK,,,,,,,,16900,0,0,0,0,0,0,0,97750,0,0,0,0,0,0,0,0,0,0,80850,0,0,0,False,0,False,False,0,0,0
2021,CAD,CAD,874,10140-003-016-00,1,41407,R,SMITH DWIGHT & MILDRED,,1110 W 1ST ST,,LAMPASAS,TX,76550,2401,94,CAD,LAM,LTR,R&B,SLA,,CLA,,,,,,False,1110,1ST ST,W,LAMPASAS,TX,76550,,L14,,False,False,A1,,,,1.000000,0,0.00,,,,0.0000,LOT:  16,BLK:  C,ADDN: HIGHLAND PARK,,,,,,,,13200,0,0,0,0,0,0,0,108170,108170,0,0,0,0,0,0,0,0,0,94970,0,0,0,False,0,False,False,0,0,0